pNMe3(+)-benzoate anion

Reaction thermochemistry data

Data compiled by: John E. Bartmess

Individual Reactions

C10H13NO2- + Hydrogen cation = C10H14NO2

By formula: C10H13NO2- + H+ = C10H14NO2

Quantity Value Units Method Reference Comment
Δr1057. ± 13.kJ/molG+TSStrittmatter, Wong, et al., 2000gas phase; This acidity is ca. 24 kcal/mol stronger than that given by G3(MP2)B3 calculations.
Quantity Value Units Method Reference Comment
Δr1028. ± 13.kJ/molCIDCStrittmatter, Wong, et al., 2000gas phase; This acidity is ca. 24 kcal/mol stronger than that given by G3(MP2)B3 calculations.

References

Strittmatter, Wong, et al., 2000
Strittmatter, E.F.; Wong, R.L.; Williams, E.R., Gas-phase basicity of (CH3)(3)N+-C6H4-COO- zwitterions: A new class of organic super bases, J. Am. Chem. Soc., 2000, 122, 6, 1247-1248, https://doi.org/10.1021/ja9934495 . [all data]