DL-Alanine, N-acetyl, methyl ester, protonated

Reaction thermochemistry data

Data compiled by: Michael M. Meot-Ner (Mautner) and Sharon G. Lias

Individual Reactions

(C6H12NO3+ • 2Water) + Water = (C6H12NO3+ • 3Water)

By formula: (C6H12NO3+ • 2H2O) + H2O = (C6H12NO3+ • 3H2O)

Bond type: Hydrogen bonds with polydentate bonding in positive ions

Quantity Value Units Method Reference Comment
Δr40.kJ/molPHPMSMeot-Ner, 1984gas phase
Quantity Value Units Method Reference Comment
Δr90.0J/mol*KPHPMSMeot-Ner, 1984gas phase

(C6H12NO3+ • Water) + Water = (C6H12NO3+ • 2Water)

By formula: (C6H12NO3+ • H2O) + H2O = (C6H12NO3+ • 2H2O)

Bond type: Hydrogen bonds with polydentate bonding in positive ions

Quantity Value Units Method Reference Comment
Δr51.9kJ/molPHPMSMeot-Ner, 1984gas phase
Quantity Value Units Method Reference Comment
Δr109.J/mol*KPHPMSMeot-Ner, 1984gas phase

C6H12NO3+ + L-Alanine, N-acetyl-, methyl ester = (C6H12NO3+ • L-Alanine, N-acetyl-, methyl ester)

By formula: C6H12NO3+ + C6H11NO3 = (C6H12NO3+ • C6H11NO3)

Bond type: Hydrogen bonds with polydentate bonding in positive ions

Quantity Value Units Method Reference Comment
Δr126.kJ/molPHPMSMeot-Ner, 1984gas phase
Quantity Value Units Method Reference Comment
Δr132.J/mol*KPHPMSMeot-Ner, 1984gas phase

C6H12NO3+ + Water = (C6H12NO3+ • Water)

By formula: C6H12NO3+ + H2O = (C6H12NO3+ • H2O)

Bond type: Hydrogen bonds with polydentate bonding in positive ions

Quantity Value Units Method Reference Comment
Δr54.4kJ/molPHPMSMeot-Ner, 1984gas phase
Quantity Value Units Method Reference Comment
Δr88.7J/mol*KPHPMSMeot-Ner, 1984gas phase

C6H12NO3+ + Acetic acid = (C6H12NO3+ • Acetic acid)

By formula: C6H12NO3+ + C2H4O2 = (C6H12NO3+ • C2H4O2)

Bond type: Hydrogen bonds with polydentate bonding in positive ions

Quantity Value Units Method Reference Comment
Δr75.7kJ/molPHPMSMeot-Ner, 1984gas phase
Quantity Value Units Method Reference Comment
Δr114.J/mol*KPHPMSMeot-Ner, 1984gas phase

C6H12NO3+ + Methylamine = (C6H12NO3+ • Methylamine)

By formula: C6H12NO3+ + CH5N = (C6H12NO3+ • CH5N)

Bond type: Hydrogen bonds with polydentate bonding in positive ions

Quantity Value Units Method Reference Comment
Δr120.kJ/molPHPMSMeot-Ner, 1984gas phase
Quantity Value Units Method Reference Comment
Δr83.3J/mol*KPHPMSMeot-Ner, 1984gas phase

References

Meot-Ner, 1984
Meot-Ner, (Mautner), The Ionic Hydrogen Bond. 4. Intramolecular and Multiple Bonds. Proton Affinities, Hydration and Complexes of Amides and Amino Acid Derivatives, J. Am. Chem. Soc., 1984, 106, 2, 278, https://doi.org/10.1021/ja00314a003 . [all data]