Tetrahydropyran, protonated

Ion clustering data

Data compiled by: Michael M. Meot-Ner (Mautner) and Sharon G. Lias

Clustering reactions

C5H11O+ + Acetonitrile = (C5H11O+ • Acetonitrile)

By formula: C5H11O+ + C2H3N = (C5H11O+ • C2H3N)

Free energy of reaction

ΔrG° (kJ/mol) T (K) Method Reference Comment
84.9320.ICRBromilow, Abboud, et al., 1980gas phase; switching reaction,n((CH3)2OH+)(CH3)2O; Grimsrud and Kebarle, 1973

References

Bromilow, Abboud, et al., 1980
Bromilow, J.; Abboud, J.L.M.; Lebrilla, C.B.; Taft, R.W.; Scorrano, G.; Lucchini, V., Oxonium Ions. Solvation by Single Acetonitrile Molecules in the Gas Phase and by Bulk Solvents, J. Am. Chem. Soc., 1980, 103, 18, 5448, https://doi.org/10.1021/ja00408a028 . [all data]

Grimsrud and Kebarle, 1973
Grimsrud, E.P.; Kebarle, P., Gas Phase Ion Equilibria Studies of the Solvation of the Hydrogen Ion by Methanol, Dimethyl Ether and Water. Effect of Hydrogen Bonding, J. Am. Chem. Soc., 1973, 95, 24, 7939, https://doi.org/10.1021/ja00805a002 . [all data]