t-Pentyl, positive ion

Ion clustering data

Data compiled by: Michael M. Meot-Ner (Mautner) and Sharon G. Lias

Clustering reactions

C5H11+ + Methylene chloride = (C5H11+ • Methylene chloride)

By formula: C5H11+ + CH2Cl2 = (C5H11+ • CH2Cl2)

Quantity Value Units Method Reference Comment
Δr40.kJ/molPHPMSSharma, Meza de Hojer, et al., 1985gas phase
Quantity Value Units Method Reference Comment
Δr97.5J/mol*KPHPMSSharma, Meza de Hojer, et al., 1985gas phase

Reaction thermochemistry data

Data compiled by: Michael M. Meot-Ner (Mautner) and Sharon G. Lias

Individual Reactions

C5H11+ + Methylene chloride = (C5H11+ • Methylene chloride)

By formula: C5H11+ + CH2Cl2 = (C5H11+ • CH2Cl2)

Quantity Value Units Method Reference Comment
Δr9.5kcal/molPHPMSSharma, Meza de Hojer, et al., 1985gas phase
Quantity Value Units Method Reference Comment
Δr23.3cal/mol*KPHPMSSharma, Meza de Hojer, et al., 1985gas phase

References

Sharma, Meza de Hojer, et al., 1985
Sharma, D.M.S.; Meza de Hojer, S.; Kebarle, P., Stabilities of halonium ions from a study of gas-phase equilibria R+ + XR' = (RXR')+, J. Am. Chem. Soc., 1985, 107, 13, 3757, https://doi.org/10.1021/ja00299a002 . [all data]