Methyl propionate, protonated

Ion clustering data

Data compiled by: Michael M. Meot-Ner (Mautner) and Sharon G. Lias

Clustering reactions

C4H9O2+ + Hydrogen cyanide = (C4H9O2+ • Hydrogen cyanide)

By formula: C4H9O2+ + CHN = (C4H9O2+ • CHN)

Quantity Value Units Method Reference Comment
Δr79.5kJ/molPHPMSSpeller and Meot-Ner (Mautner), 1985gas phase; Entropy change calculated or estimated
Quantity Value Units Method Reference Comment
Δr96.J/mol*KN/ASpeller and Meot-Ner (Mautner), 1985gas phase; Entropy change calculated or estimated

Free energy of reaction

ΔrG° (kJ/mol) T (K) Method Reference Comment
33.455.PHPMSSpeller and Meot-Ner (Mautner), 1985gas phase; Entropy change calculated or estimated

Reaction thermochemistry data

Data compiled by: Michael M. Meot-Ner (Mautner) and Sharon G. Lias

Individual Reactions

C4H9O2+ + Hydrogen cyanide = (C4H9O2+ • Hydrogen cyanide)

By formula: C4H9O2+ + CHN = (C4H9O2+ • CHN)

Quantity Value Units Method Reference Comment
Δr19.0kcal/molPHPMSSpeller and Meot-Ner (Mautner), 1985gas phase; Entropy change calculated or estimated
Quantity Value Units Method Reference Comment
Δr23.cal/mol*KN/ASpeller and Meot-Ner (Mautner), 1985gas phase; Entropy change calculated or estimated

Free energy of reaction

ΔrG° (kcal/mol) T (K) Method Reference Comment
7.9455.PHPMSSpeller and Meot-Ner (Mautner), 1985gas phase; Entropy change calculated or estimated

References

Speller and Meot-Ner (Mautner), 1985
Speller, C.V.; Meot-Ner (Mautner), M., The Ionic Hydrogen Bond and Ion Solvation. 3. Bonds Involving Cyanides. Correlations with Proton Affinites, J. Phys. Chem., 1985, 81, 24, 5217, https://doi.org/10.1021/j100270a020 . [all data]