Butanenitrile, protonated

Ion clustering data

Data compiled by: Michael M. Meot-Ner (Mautner) and Sharon G. Lias

Clustering reactions

C4H8N+ + Hydrogen cyanide = (C4H8N+ • Hydrogen cyanide)

By formula: C4H8N+ + CHN = (C4H8N+ • CHN)

Quantity Value Units Method Reference Comment
Δr84.1kJ/molPHPMSSpeller and Meot-Ner (Mautner), 1985gas phase
Quantity Value Units Method Reference Comment
Δr94.1J/mol*KPHPMSSpeller and Meot-Ner (Mautner), 1985gas phase

C4H8N+ + Water = (C4H8N+ • Water)

By formula: C4H8N+ + H2O = (C4H8N+ • H2O)

Bond type: Hydrogen bond (positive ion to hydride)

Quantity Value Units Method Reference Comment
Δr80.3kJ/molPHPMSSpeller and Meot-Ner (Mautner), 1985gas phase
Quantity Value Units Method Reference Comment
Δr87.0J/mol*KPHPMSSpeller and Meot-Ner (Mautner), 1985gas phase

References

Speller and Meot-Ner (Mautner), 1985
Speller, C.V.; Meot-Ner (Mautner), M., The Ionic Hydrogen Bond and Ion Solvation. 3. Bonds Involving Cyanides. Correlations with Proton Affinites, J. Phys. Chem., 1985, 81, 24, 5217, https://doi.org/10.1021/j100270a020 . [all data]