Dimethyl amine, protonated

Ion clustering data

Data compiled by: Michael M. Meot-Ner (Mautner) and Sharon G. Lias

Clustering reactions

C2H8N+ + Methylamine = (C2H8N+ • Methylamine)

By formula: C2H8N+ + CH5N = (C2H8N+ • CH5N)

Quantity Value Units Method Reference Comment
Δr22.4kcal/molPHPMSYamdagni and Kebarle, 1973gas phase
Quantity Value Units Method Reference Comment
Δr29.2cal/mol*KPHPMSYamdagni and Kebarle, 1973gas phase

C2H8N+ + Dimethylamine = (C2H8N+ • Dimethylamine)

By formula: C2H8N+ + C2H7N = (C2H8N+ • C2H7N)

Quantity Value Units Method Reference Comment
Δr24.1kcal/molPHPMSMeot-Ner (Mautner), 1992gas phase
Δr20.8kcal/molPHPMSYamdagni and Kebarle, 1973gas phase
Quantity Value Units Method Reference Comment
Δr28.1cal/mol*KPHPMSMeot-Ner (Mautner), 1992gas phase
Δr25.7cal/mol*KPHPMSYamdagni and Kebarle, 1973gas phase

(C2H8N+ • Dimethylamine) + Dimethylamine = (C2H8N+ • 2Dimethylamine)

By formula: (C2H8N+ • C2H7N) + C2H7N = (C2H8N+ • 2C2H7N)

Quantity Value Units Method Reference Comment
Δr16.4kcal/molPHPMSMeot-Ner (Mautner), 1992gas phase
Quantity Value Units Method Reference Comment
Δr27.2cal/mol*KPHPMSMeot-Ner (Mautner), 1992gas phase

(C2H8N+ • 2Dimethylamine) + Dimethylamine = (C2H8N+ • 3Dimethylamine)

By formula: (C2H8N+ • 2C2H7N) + C2H7N = (C2H8N+ • 3C2H7N)

Quantity Value Units Method Reference Comment
Δr9.9kcal/molPHPMSMeot-Ner (Mautner), 1992gas phase
Quantity Value Units Method Reference Comment
Δr26.1cal/mol*KPHPMSMeot-Ner (Mautner), 1992gas phase

(C2H8N+ • 3Dimethylamine) + Dimethylamine = (C2H8N+ • 4Dimethylamine)

By formula: (C2H8N+ • 3C2H7N) + C2H7N = (C2H8N+ • 4C2H7N)

Quantity Value Units Method Reference Comment
Δr7.9kcal/molPHPMSMeot-Ner (Mautner), 1992gas phase
Quantity Value Units Method Reference Comment
Δr22.5cal/mol*KPHPMSMeot-Ner (Mautner), 1992gas phase

(C2H8N+ • 4Dimethylamine) + Dimethylamine = (C2H8N+ • 5Dimethylamine)

By formula: (C2H8N+ • 4C2H7N) + C2H7N = (C2H8N+ • 5C2H7N)

Quantity Value Units Method Reference Comment
Δr6.3kcal/molPHPMSMeot-Ner (Mautner), 1992gas phase
Quantity Value Units Method Reference Comment
Δr22.5cal/mol*KPHPMSMeot-Ner (Mautner), 1992gas phase

C2H8N+ + Water = (C2H8N+ • Water)

By formula: C2H8N+ + H2O = (C2H8N+ • H2O)

Bond type: Hydrogen bond (positive ion to hydride)

Quantity Value Units Method Reference Comment
Δr15.0kcal/molPHPMSMeot-Ner (Mautner), 1984gas phase
Quantity Value Units Method Reference Comment
Δr22.9cal/mol*KPHPMSMeot-Ner (Mautner), 1984gas phase
Quantity Value Units Method Reference Comment
Δr9.1kcal/molHPMSBanic and Iribarne, 1985gas phase; electric fields

(C2H8N+ • Water) + Water = (C2H8N+ • 2Water)

By formula: (C2H8N+ • H2O) + H2O = (C2H8N+ • 2H2O)

Bond type: Hydrogen bond (positive ion to hydride)

Quantity Value Units Method Reference Comment
Δr13.5kcal/molPHPMSMeot-Ner (Mautner), 1984gas phase
Quantity Value Units Method Reference Comment
Δr24.7cal/mol*KPHPMSMeot-Ner (Mautner), 1984gas phase
Quantity Value Units Method Reference Comment
Δr6.2kcal/molHPMSBanic and Iribarne, 1985gas phase; electric fields

(C2H8N+ • 2Water) + Water = (C2H8N+ • 3Water)

By formula: (C2H8N+ • 2H2O) + H2O = (C2H8N+ • 3H2O)

Bond type: Hydrogen bond (positive ion to hydride)

Quantity Value Units Method Reference Comment
Δr11.3kcal/molPHPMSMeot-Ner (Mautner), 1984gas phase
Quantity Value Units Method Reference Comment
Δr24.4cal/mol*KPHPMSMeot-Ner (Mautner), 1984gas phase
Quantity Value Units Method Reference Comment
Δr4.2kcal/molHPMSBanic and Iribarne, 1985gas phase; electric fields

(C2H8N+ • 3Water) + Water = (C2H8N+ • 4Water)

By formula: (C2H8N+ • 3H2O) + H2O = (C2H8N+ • 4H2O)

Bond type: Hydrogen bond (positive ion to hydride)

Quantity Value Units Method Reference Comment
Δr10.5kcal/molPHPMSMeot-Ner (Mautner), 1984gas phase
Quantity Value Units Method Reference Comment
Δr25.2cal/mol*KPHPMSMeot-Ner (Mautner), 1984gas phase

(C2H8N+ • 4Water) + Water = (C2H8N+ • 5Water)

By formula: (C2H8N+ • 4H2O) + H2O = (C2H8N+ • 5H2O)

Bond type: Hydrogen bond (positive ion to hydride)

Quantity Value Units Method Reference Comment
Δr9.4kcal/molPHPMSMeot-Ner (Mautner), 1984gas phase
Quantity Value Units Method Reference Comment
Δr24.4cal/mol*KPHPMSMeot-Ner (Mautner), 1984gas phase

(C2H8N+ • 5Water) + Water = (C2H8N+ • 6Water)

By formula: (C2H8N+ • 5H2O) + H2O = (C2H8N+ • 6H2O)

Bond type: Hydrogen bond (positive ion to hydride)

Quantity Value Units Method Reference Comment
Δr8.4kcal/molPHPMSMeot-Ner (Mautner), 1984gas phase; Entropy change calculated or estimated
Quantity Value Units Method Reference Comment
Δr21.2cal/mol*KN/AMeot-Ner (Mautner), 1984gas phase; Entropy change calculated or estimated

Free energy of reaction

ΔrG° (kcal/mol) T (K) Method Reference Comment
3.0255.PHPMSMeot-Ner (Mautner), 1984gas phase; Entropy change calculated or estimated

C2H8N+ + Ammonia = (C2H8N+ • Ammonia)

By formula: C2H8N+ + H3N = (C2H8N+ • H3N)

Bond type: Hydrogen bond (positive ion to hydride)

Quantity Value Units Method Reference Comment
Δr20.6kcal/molPHPMSYamdagni and Kebarle, 1974gas phase
Quantity Value Units Method Reference Comment
Δr28.2cal/mol*KPHPMSYamdagni and Kebarle, 1974gas phase

References

Yamdagni and Kebarle, 1973
Yamdagni, R.; Kebarle, P., Gas - Phase Basicites of Amines. Hydrogen Bonding in Proton - Bound Amine Dimers and Proton - Induced Cyclization of alpha, omega - Diamines, J. Am. Chem. Soc., 1973, 95, 11, 3504, https://doi.org/10.1021/ja00792a010 . [all data]

Meot-Ner (Mautner), 1992
Meot-Ner (Mautner), M., Intermolecular Forces in Organic Clusters, J. Am. Chem. Soc., 1992, 114, 9, 3312, https://doi.org/10.1021/ja00035a024 . [all data]

Meot-Ner (Mautner), 1984
Meot-Ner (Mautner), M., The Ionic Hydrogen Bond and Ion Solvation. 2. Hydration of Onium Ions by 1 - 7 H2O Molecules. Relations Between Monomolecular, Specific and Bulk Hydration, J. Am. Chem. Soc., 1984, 106, 5, 1265, https://doi.org/10.1021/ja00317a016 . [all data]

Banic and Iribarne, 1985
Banic, C.M.; Iribarne, J.V., Equilibrium Constants for Clustering of Neutral Molecules about Gaseous Ions, J. Chem. Phys., 1985, 83, 12, 6432, https://doi.org/10.1063/1.449543 . [all data]

Yamdagni and Kebarle, 1974
Yamdagni, R.; Kebarle, P., The hydrogen bond energies in ClHCl- and Cl-(HCl)n, Can. J. Chem., 1974, 52, 2449. [all data]