Fluorene, protonated

Reaction thermochemistry data

Data compiled by: Michael M. Meot-Ner (Mautner) and Sharon G. Lias

Individual Reactions

C13H11+ + Fluorene = (C13H11+ • Fluorene)

By formula: C13H11+ + C13H10 = (C13H11+ • C13H10)

Quantity Value Units Method Reference Comment
Δr14.4kcal/molPHPMSMeot-Ner (Mautner), 1980gas phase; Entropy change calculated or estimated
Quantity Value Units Method Reference Comment
Δr28.cal/mol*KN/AMeot-Ner (Mautner), 1980gas phase; Entropy change calculated or estimated
Quantity Value Units Method Reference Comment
Δr6.1kcal/molPHPMSMeot-Ner (Mautner), 1980gas phase; Entropy change calculated or estimated

References

Meot-Ner (Mautner), 1980
Meot-Ner (Mautner), M., Dimer Cations of Polycyclic Aromatics: Experimental Bonding Energies and Resonance Stabilization, J. Phys. Chem., 1980, 84, 21, 2724, https://doi.org/10.1021/j100458a012 . [all data]