o-tBu-benzoate anion

Gas phase ion energetics data

Data compiled by: John E. Bartmess

Protonation reactions

C11H13O2- + Hydrogen cation = 2-Tert-butylbenzoic acid

By formula: C11H13O2- + H+ = C11H14O2

Quantity Value Units Method Reference Comment
Δr1407. ± 9.2kJ/molG+TSKulhanek, Decouzon, et al., 1999gas phase
Quantity Value Units Method Reference Comment
Δr1378. ± 8.4kJ/molIMREKulhanek, Decouzon, et al., 1999gas phase

References

Kulhanek, Decouzon, et al., 1999
Kulhanek, J.; Decouzon, M.; Gal, J.F.; Maria, P.C.; Fiedler, P.; Jimenez, P.; Roux, M.V.; Exner, O., Steric effects and steric hindrance to resonance in tert-butylbenzoic acids in the gas phase and in solution, Eur. J. Org., 1999, Chem., 7, 1589-1594, https://doi.org/10.1002/(SICI)1099-0690(199907)1999:7<1589::AID-EJOC1589>3.0.CO;2-S . [all data]