(Me2P)2CH anion

Reaction thermochemistry data

Data compiled by: John E. Bartmess

Individual Reactions

C5H13P2- + Hydrogen cation = Bis(dimethylphosphino)methane

By formula: C5H13P2- + H+ = C5H14P2

Quantity Value Units Method Reference Comment
Δr1549. ± 9.2kJ/molG+TSRomer, Gatev, et al., 1998gas phase
Quantity Value Units Method Reference Comment
Δr1517. ± 8.4kJ/molIMRERomer, Gatev, et al., 1998gas phase

Gas phase ion energetics data

Data compiled by: John E. Bartmess

Electron affinity of neutral species

EAneutral (eV) Method Reference Comment
1.5308 ± 0.0087LPDRomer, Gatev, et al., 1998

Protonation reactions

C5H13P2- + Hydrogen cation = Bis(dimethylphosphino)methane

By formula: C5H13P2- + H+ = C5H14P2

Quantity Value Units Method Reference Comment
Δr370.3 ± 2.2kcal/molG+TSRomer, Gatev, et al., 1998gas phase
Quantity Value Units Method Reference Comment
Δr362.6 ± 2.0kcal/molIMRERomer, Gatev, et al., 1998gas phase

References

Romer, Gatev, et al., 1998
Romer, B.; Gatev, G.G.; Zhong, M.; Brauman, J.I., Alpha-Stabilization by Silyl and Phosphino Substitution, J. Am. Chem. Soc., 1998, 120, 12, 2919, https://doi.org/10.1021/ja970279s . [all data]