(EtOH)3..I anion

Ion clustering data

Data compiled by: John E. Bartmess

Clustering reactions

Iodide + 3Ethanol = C6H18IO3-

By formula: I- + 3C2H6O = C6H18IO3-

Quantity Value Units Method Reference Comment
Δr8.40 ± 0.50kcal/molTDAsBogdanov, Peschke, et al., 1999gas phase
Quantity Value Units Method Reference Comment
Δr3.51kcal/molTDAsBogdanov, Peschke, et al., 1999gas phase

References

Bogdanov, Peschke, et al., 1999
Bogdanov, B.; Peschke, M.; Tonner, D.S.; Szulejko, J.E.; McMahon, T.B., Stepwise solvation of halides by alcohol molecules in the gas phase, Int. J. Mass Spectrom., 1999, 187, 707-725, https://doi.org/10.1016/S1387-3806(98)14180-5 . [all data]