(EtOH)2..I anion

Reaction thermochemistry data

Data compiled by: John E. Bartmess

Individual Reactions

Iodide + 2Ethanol = C4H12IO2-

By formula: I- + 2C2H6O = C4H12IO2-

Quantity Value Units Method Reference Comment
Δr43.93 ± 0.84kJ/molTDAsBogdanov, Peschke, et al., 1999gas phase
Quantity Value Units Method Reference Comment
Δr18.5kJ/molTDAsBogdanov, Peschke, et al., 1999gas phase

References

Bogdanov, Peschke, et al., 1999
Bogdanov, B.; Peschke, M.; Tonner, D.S.; Szulejko, J.E.; McMahon, T.B., Stepwise solvation of halides by alcohol molecules in the gas phase, Int. J. Mass Spectrom., 1999, 187, 707-725, https://doi.org/10.1016/S1387-3806(98)14180-5 . [all data]