CO..Cp(CO)2V anion

Ion clustering data

Data compiled by: John E. Bartmess

Clustering reactions

C7H5O2V- + Carbon monoxide = C8H5O3V-

By formula: C7H5O2V- + CO = C8H5O3V-

Quantity Value Units Method Reference Comment
Δr31.8 ± 2.5kJ/molN/ASunderlin and Squires, 1999gas phase

References

Sunderlin and Squires, 1999
Sunderlin, L.S.; Squires, R.R., Bond strengths in cyclopentadienyl metal carbonyl anions, Int. J. Mass Spectrom., 1999, 183, 149-161, https://doi.org/10.1016/S1387-3806(98)14230-6 . [all data]