(H2O)..{EtCO2H}..NO3 anion

Ion clustering data

Data compiled by: John E. Bartmess

Clustering reactions

NO3 anion + Water + Propanoic acid = C3H8NO6-

By formula: NO3- + H2O + C3H6O2 = C3H8NO6-

Quantity Value Units Method Reference Comment
Δr3.90 ± 0.20kcal/molIMREViidanoja, Reiner, et al., 2000gas phase

References

Viidanoja, Reiner, et al., 2000
Viidanoja, J.; Reiner, T.; Kiendler, A.; Grimm, F.; Arnold, F., Laboratory investigations of negative ion molecule reactions of propionic, butyric, glyoxylic, pyruvic, and pinonic acids, Int. J. Mass Spectrom., 2000, 194, 1, 53-68, https://doi.org/10.1016/S1387-3806(99)00172-4 . [all data]