(CO2)2..CO3 radical anion

Reaction thermochemistry data

Data compiled by: John E. Bartmess

Individual Reactions

C3O7- + 3Carbon dioxide = C4O9-

By formula: C3O7- + 3CO2 = C4O9-

Quantity Value Units Method Reference Comment
Δr23. ± 4.2kJ/molTDAsHiraoka and Yamabe, 1992gas phase
Quantity Value Units Method Reference Comment
Δr-4.6 ± 4.2kJ/molTDAsHiraoka and Yamabe, 1992gas phase

C2O5- + 2Carbon dioxide = C3O7-

By formula: C2O5- + 2CO2 = C3O7-

Quantity Value Units Method Reference Comment
Δr24. ± 4.2kJ/molTDAsHiraoka and Yamabe, 1992gas phase
Quantity Value Units Method Reference Comment
Δr2. ± 4.2kJ/molTDAsHiraoka and Yamabe, 1992gas phase

Gas phase thermochemistry data

Data compiled by: John E. Bartmess

Quantity Value Units Method Reference Comment
Δfgas-1339.7kJ/molTherHiraoka and Yamabe, 1992

References

Hiraoka and Yamabe, 1992
Hiraoka, K.; Yamabe, S., Formation of the Chelate Bonds in the Cluster O2(-)(CO2)n, CO3(-)(CO2)n, and NO2(-)(CO2)n, J. Chem. Phys., 1992, 97, 1, 643, https://doi.org/10.1063/1.463560 . [all data]