decafluoro-4-H-1-norbornanide anion

Reaction thermochemistry data

Data compiled by: John E. Bartmess

Individual Reactions

C7HF10- + Hydrogen cation = C7H2F10

By formula: C7HF10- + H+ = C7H2F10

Quantity Value Units Method Reference Comment
Δr1439. ± 8.8kJ/molG+TSKoppel, Pihl, et al., 1994gas phase
Quantity Value Units Method Reference Comment
Δr1405. ± 8.4kJ/molIMREKoppel, Pihl, et al., 1994gas phase

References

Koppel, Pihl, et al., 1994
Koppel, I.A.; Pihl, V.; Koppel, I.A.; Anvia, F.; Taft, R.W., Thermodynamic acidity of (CF3)3CH and 1H-undecafluorobicyclo[2.2.1]heptane: The concept of anionic (fluorine) hyperconjugation, J. Am. Chem. Soc., 1994, 116, 19, 8654, https://doi.org/10.1021/ja00098a027 . [all data]