H2O..MeOCO2 anion

Ion clustering data

Data compiled by: John E. Bartmess

Clustering reactions

C2H5O4- + 2Water = C2H7O5-

By formula: C2H5O4- + 2H2O = C2H7O5-

Quantity Value Units Method Reference Comment
Δr54.8 ± 6.3kJ/molTDAsBlades, Klassen, et al., 1995gas phase; T: 293 K. ΔSaff approx. 24 cal/mol-K
Quantity Value Units Method Reference Comment
Δr25.5 ± 1.3kJ/molTDAsBlades, Klassen, et al., 1995gas phase; T: 293 K. ΔSaff approx. 24 cal/mol-K

Reaction thermochemistry data

Data compiled by: John E. Bartmess

Individual Reactions

CAS Reg. No. 49745-25-7 + Water = C2H5O4-

By formula: CAS Reg. No. 49745-25-7 + H2O = C2H5O4-

Quantity Value Units Method Reference Comment
Δr15.3 ± 1.5kcal/molTDAsBlades, Klassen, et al., 1995gas phase; T: 293 K. ΔSaff approx. 24 cal/mol-K
Quantity Value Units Method Reference Comment
Δr8.30 ± 0.30kcal/molTDAsBlades, Klassen, et al., 1995gas phase; T: 293 K. ΔSaff approx. 24 cal/mol-K

C2H5O4- + 2Water = C2H7O5-

By formula: C2H5O4- + 2H2O = C2H7O5-

Quantity Value Units Method Reference Comment
Δr13.1 ± 1.5kcal/molTDAsBlades, Klassen, et al., 1995gas phase; T: 293 K. ΔSaff approx. 24 cal/mol-K
Quantity Value Units Method Reference Comment
Δr6.10 ± 0.30kcal/molTDAsBlades, Klassen, et al., 1995gas phase; T: 293 K. ΔSaff approx. 24 cal/mol-K

References

Blades, Klassen, et al., 1995
Blades, A.T.; Klassen, J.S.; Kebarle, P., Free Energies of Hydration in the Gas Phase on the Anions of Some Oxo Acids of C, N, S, P, Cl and I, J. Am. Chem. Soc., 1995, 117, 42, 10563, https://doi.org/10.1021/ja00147a019 . [all data]