CH2=CDC(=CH2) anion

Reaction thermochemistry data

Data compiled by: John E. Bartmess

Individual Reactions

C4H4D5- + Hydrogen cation = C4H5D5

By formula: C4H4D5- + H+ = C4H5D5

Quantity Value Units Method Reference Comment
Δr1657. ± 4.2kJ/molG+TSDevisser, Dekoning, et al., 1995gas phase
Quantity Value Units Method Reference Comment
Δr1627.2 ± 2.1kJ/molIMREDevisser, Dekoning, et al., 1995gas phase

References

Devisser, Dekoning, et al., 1995
Devisser, S.P.; Dekoning, L.J.; Vanderhart, W.J.; Nibbering, N.M.M., Chemical properties of butadienyl anions in the gas-phase, Recl. Trav. Chim. Pays-Bas, 1995, 114, 6, 267, https://doi.org/10.1002/recl.19951140603 . [all data]