ISH radical anion

Gas phase thermochemistry data

Data compiled by: John E. Bartmess

Quantity Value Units Method Reference Comment
Δfgas-48.24kJ/molEndoRefaey, 1976I- + H2S ->. Computation at a variety of levels imply that the anion is not bound with repect to dissociatve attachment.

References

Refaey, 1976
Refaey, K.M.A., Endoergic ion-molecule-collision processes of negative ions. II. Collisions of I- on H2S, CS2, and COS, J. Chem. Phys., 1976, 65, 2002. [all data]