3,5-diCF3-pyrazolide anion

Reaction thermochemistry data

Data compiled by: John E. Bartmess

Individual Reactions

C5HF6N2- + Hydrogen cation = 3,5-Bis(trifluoromethyl)pyrazol

By formula: C5HF6N2- + H+ = C5H2F6N2

Quantity Value Units Method Reference Comment
Δr1358. ± 8.8kJ/molG+TSKoppel, Taft, et al., 1994gas phase
Quantity Value Units Method Reference Comment
Δr1328. ± 8.4kJ/molIMREKoppel, Taft, et al., 1994gas phase

References

Koppel, Taft, et al., 1994
Koppel, I.A.; Taft, R.W.; Anvia, F.; Zhu, S.Z.; Hu, L.Q.; Sung, K.S.; Desmarteau, D.D.; Yagupolskii, L.M., The Gas-Phase Acidities of Very Strong Neutral Bronsted Acids, J. Am. Chem. Soc., 1994, 116, 7, 3047, https://doi.org/10.1021/ja00086a038 . [all data]