H3SiCH2 anion

Reaction thermochemistry data

Data compiled by: John E. Bartmess

Individual Reactions

CH5Si- + Hydrogen cation = Silane, methyl-

By formula: CH5Si- + H+ = CH6Si

Quantity Value Units Method Reference Comment
Δr1625. ± 17.kJ/molG+TSDamrauer, Kass, et al., 1988gas phase; Slightly less acidic then fluorobenzene
Quantity Value Units Method Reference Comment
Δr1590. ± 17.kJ/molIMRBDamrauer, Kass, et al., 1988gas phase; Slightly less acidic then fluorobenzene

Gas phase ion energetics data

Data compiled by: John E. Bartmess

Protonation reactions

CH5Si- + Hydrogen cation = Silane, methyl-

By formula: CH5Si- + H+ = CH6Si

Quantity Value Units Method Reference Comment
Δr388.4 ± 4.1kcal/molG+TSDamrauer, Kass, et al., 1988gas phase; Slightly less acidic then fluorobenzene
Quantity Value Units Method Reference Comment
Δr380.0 ± 4.0kcal/molIMRBDamrauer, Kass, et al., 1988gas phase; Slightly less acidic then fluorobenzene

References

Damrauer, Kass, et al., 1988
Damrauer, R.; Kass, S.R.; DePuy, C.H., Gas-Phase Acidities of Methylsilanes: C-H versus Si-H, Organomet., 1988, 7, 3, 637, https://doi.org/10.1021/om00093a011 . [all data]