Cr(CO)5(H2)

Reaction thermochemistry data

Data compiled by: José A. Martinho Simões

Individual Reactions

C5H2CrO5 (g) = Hydrogen (g) + C5CrO5 (g)

By formula: C5H2CrO5 (g) = H2 (g) + C5CrO5 (g)

Quantity Value Units Method Reference Comment
Δr62.8 ± 5.4kJ/molKinGWells, House, et al., 1994The reaction enthalpy relies on the measured activation energy and on the assumption of a negligible barrier for product recombination Wells, House, et al., 1994.

References

Wells, House, et al., 1994
Wells, J.R.; House, P.G.; Weitz, E., J. Phys. Chem., 1994, 98, 8343. [all data]