Mo(CO)5(Xe)

Reaction thermochemistry data

Data compiled by: José A. Martinho Simões

Individual Reactions

C5MoO5Xe (g) = C5MoO5 (g) + Xenon (g)

By formula: C5MoO5Xe (g) = C5MoO5 (g) + Xe (g)

Quantity Value Units Method Reference Comment
Δr33.5 ± 4.2kJ/molKinGWells and Weitz, 1992The reaction enthalpy relies on 31.0 ± 4.2 kJ/mol for the activation energy and on the assumption of a negligible barrier for product recombination Wells and Weitz, 1992

References

Wells and Weitz, 1992
Wells, J.R.; Weitz, E., J. Am. Chem. Soc., 1992, 114, 2783. [all data]