Hf(Cp*)2(Me)2

Reaction thermochemistry data

Data compiled by: José A. Martinho Simões

Individual Reactions

C22H36Hf (solution) + 2Iodine (solution) = C20H30HfI2 (solution) + 2Methane, iodo- (solution)

By formula: C22H36Hf (solution) + 2I2 (solution) = C20H30HfI2 (solution) + 2CH3I (solution)

Quantity Value Units Method Reference Comment
Δr-63.41 ± 0.79kcal/molRSCSchock and Marks, 1988solvent: Toluene

References

Schock and Marks, 1988
Schock, L.E.; Marks, T.J., J. Am. Chem. Soc., 1988, 110, 7701. [all data]