3-Me-thiophenide anion

Gas phase ion energetics data

Data compiled by: John E. Bartmess

Protonation reactions

C5H5S- + Hydrogen cation = Thiophene, 3-methyl-

By formula: C5H5S- + H+ = C5H6S

Quantity Value Units Method Reference Comment
Δr1593. ± 13.kJ/molG+TSDePuy, Kass, et al., 1988gas phase; Acid: 3-methylthiophene. Between MeOH, EtOH. 1 D exchange implies ring proton as site.
Quantity Value Units Method Reference Comment
Δr1561. ± 13.kJ/molIMRBDePuy, Kass, et al., 1988gas phase; Acid: 3-methylthiophene. Between MeOH, EtOH. 1 D exchange implies ring proton as site.

Reaction thermochemistry data

Data compiled by: John E. Bartmess

Individual Reactions

C5H5S- + Hydrogen cation = Thiophene, 3-methyl-

By formula: C5H5S- + H+ = C5H6S

Quantity Value Units Method Reference Comment
Δr1593. ± 13.kJ/molG+TSDePuy, Kass, et al., 1988gas phase; Acid: 3-methylthiophene. Between MeOH, EtOH. 1 D exchange implies ring proton as site.
Quantity Value Units Method Reference Comment
Δr1561. ± 13.kJ/molIMRBDePuy, Kass, et al., 1988gas phase; Acid: 3-methylthiophene. Between MeOH, EtOH. 1 D exchange implies ring proton as site.

References

DePuy, Kass, et al., 1988
DePuy, C.H.; Kass, S.R.; Bean, G.P., Formation and Reactions of Heteroaromatic Anions in the Gas Phase, J. Org. Chem., 1988, 53, 19, 4427, https://doi.org/10.1021/jo00254a001 . [all data]