2,3,5,6-tetrafluorophenoxide anion

Reaction thermochemistry data

Data compiled by: John E. Bartmess

Individual Reactions

C6HF4O- + Hydrogen cation = 2,3,5,6-Tetrafluorophenol

By formula: C6HF4O- + H+ = C6H2F4O

Quantity Value Units Method Reference Comment
Δr337.1 ± 2.8kcal/molD-EAHernandez-Gill, Wentworth, et al., 1984gas phase; Probably ca. 10 kcal/mol more acidic than this, based on substituent effects - JEB

References

Hernandez-Gill, Wentworth, et al., 1984
Hernandez-Gill, N.; Wentworth, W.E.; Chen, E.C.M., Electron affinities of fluorinated phenoxy radicals, J. Phys. Chem., 1984, 88, 6181. [all data]