3,5-diCF3-benzoate anion

Reaction thermochemistry data

Data compiled by: John E. Bartmess

Individual Reactions

C9H3F6O2- + Hydrogen cation = 3,5-Bis(trifluoromethyl)benzoic acid

By formula: C9H3F6O2- + H+ = C9H4F6O2

Quantity Value Units Method Reference Comment
Δr1357. ± 8.8kJ/molG+TSJinfeng, Topsom, et al., 1988gas phase; value altered from reference due to change in acidity scale
Quantity Value Units Method Reference Comment
Δr1328. ± 8.4kJ/molIMREJinfeng, Topsom, et al., 1988gas phase; value altered from reference due to change in acidity scale

References

Jinfeng, Topsom, et al., 1988
Jinfeng, C.; Topsom, R.D.; Headley, A.D.; Koppel, I.; Mishima, M.; Taft, R.W.; Veji, S., Acidities of Substituted Acetic Acids, J. Mol. Struct., 1988, 168, 141, https://doi.org/10.1016/0166-1280(88)80349-X . [all data]