oCl-benzoate anion

Reaction thermochemistry data

Data compiled by: John E. Bartmess

Individual Reactions

C7H4ClO2- + Hydrogen cation = Benzoic acid, 2-chloro-

By formula: C7H4ClO2- + H+ = C7H5ClO2

Quantity Value Units Method Reference Comment
Δr335.1 ± 2.1kcal/molG+TSKebarle and McMahon, 1977gas phase
Quantity Value Units Method Reference Comment
Δr328.2 ± 2.0kcal/molIMREKebarle and McMahon, 1977gas phase

References

Kebarle and McMahon, 1977
Kebarle, P.; McMahon, T.B., Intrinsic Acidities of Substituted Phenols and Benzoic Acids Determined by Gas Phase Proton Transfer Equilibria, J. Am. Chem. Soc., 1977, 99, 7, 2222, https://doi.org/10.1021/ja00449a032 . [all data]