pyrazolide anion

Reaction thermochemistry data

Data compiled by: John E. Bartmess

Individual Reactions

C3H3N2- + Hydrogen cation = 1H-Pyrazole

By formula: C3H3N2- + H+ = C3H4N2

Quantity Value Units Method Reference Comment
Δr1479. ± 10.kJ/molG+TSGianola, Ichino, et al., 2006gas phase
Δr1479. ± 10.kJ/molG+TSTaft, Anvia, et al., 1986gas phase; value altered from reference due to change in acidity scale
Quantity Value Units Method Reference Comment
Δr1449. ± 9.6kJ/molN/AGianola, Ichino, et al., 2006gas phase
Δr1449. ± 9.6kJ/molIMRETaft, Anvia, et al., 1986gas phase; value altered from reference due to change in acidity scale

References

Gianola, Ichino, et al., 2006
Gianola, A.J.; Ichino, T.; Kato, S.; Bierbaum, V.M.; Lineberger, W.C., Thermochemical studies of pyrazolide, J. Phys. Chem. A, 2006, 110, 27, 8457-8466, https://doi.org/10.1021/jp057499+ . [all data]

Taft, Anvia, et al., 1986
Taft, R.W.; Anvia, F.; Taagepera, M.; Catalan, J.; Elgueroy, J., Electrostatic proximity effects in the relative basicities of pyrazole, imidazole, pyridazine, and pyrimidine, J. Am. Chem. Soc., 1986, 108, 3237. [all data]