9-iPr-fluorenide anion

Reaction thermochemistry data

Data compiled by: John E. Bartmess

Individual Reactions

C16H15- + Hydrogen cation = 9H-Fluorene, 9-(1-methylethyl)-

By formula: C16H15- + H+ = C16H16

Quantity Value Units Method Reference Comment
Δr1469. ± 8.8kJ/molG+TSTaft and Bordwell, 1988gas phase
Quantity Value Units Method Reference Comment
Δr1437. ± 8.4kJ/molIMRETaft and Bordwell, 1988gas phase

References

Taft and Bordwell, 1988
Taft, R.W.; Bordwell, F.G., Structural and Solvent Effects Evaluated from Acidities Measured in Dimethyl Sulfoxide and in the Gas Phase, Acc. Chem. Res., 1988, 21, 12, 463, https://doi.org/10.1021/ar00156a005 . [all data]