pF-C6H4CHCN anion

Gas phase ion energetics data

Data compiled by: John E. Bartmess

Protonation reactions

C8H5FN- + Hydrogen cation = Benzeneacetonitrile, 4-fluoro-

By formula: C8H5FN- + H+ = C8H6FN

Quantity Value Units Method Reference Comment
Δr349.0 ± 2.1kcal/molG+TSTaft, 1987gas phase; value altered from reference due to change in acidity scale
Quantity Value Units Method Reference Comment
Δr342.4 ± 2.0kcal/molIMRETaft, 1987gas phase; value altered from reference due to change in acidity scale

References

Taft, 1987
Taft, R.W., The Nature and Analysis of Substitutent Electronic Effects, Personal communication. See also Prog. Phys. Org. Chem., 1987, 16, 1. [all data]