2-Ketobutyric acid oxime, bis(trimethylsilyl)-

Van Den Dool and Kratz RI, non-polar column, temperature ramp

Data compiled by: NIST Mass Spectrometry Data Center, William E. Wallace, director

Column type CapillaryCapillaryPacked
Active phase SE-52CP Sil 5 CBOV-1
Column length (m) 25. 1.8
Carrier gas HeN2N2
Substrate   100-120 mesh
Column diameter (mm) 0.32
Phase thickness (μm) 0.52
Tstart (C) 70.60.70.
Tend (C) 270.280.290.
Heat rate (K/min) 5.6.28.
Initial hold (min)  0.50.5
Final hold (min)  5.
I 1200.1187.1188.
ReferenceLefevere, Verhaeghe, et al., 1989Wurth, Kumps, et al., 1989Tanaka, Hine, et al., 1980
Comment MSDC-RI MSDC-RI MSDC-RI

References

Lefevere, Verhaeghe, et al., 1989
Lefevere, M.F.; Verhaeghe, B.J.; Declerck, D.H.; Van Bocxlaer, J.F.; De Leenheer, A.P.; De Sagher, R.M., Metabolic Profiling of Urinary Organic Acids by Single and Multicolumn Capillary Gas Chromatography, J. Chromatogr. Sci., 1989, 27, 1, 23-29, https://doi.org/10.1093/chromsci/27.1.23 . [all data]

Wurth, Kumps, et al., 1989
Wurth, C.; Kumps, A.; Mardens, Y., Urinary organic acids: Retention indices on two capillary gas chromatography columns, J. Chromatogr., 1989, 491, 186-192, https://doi.org/10.1016/S0378-4347(00)82831-5 . [all data]

Tanaka, Hine, et al., 1980
Tanaka, K.; Hine, D.G.; West-Dull, A.; Lynn, T.B., Gas-chromatographic method of analysis for urinary organic acids. I. Retention indices of 155 metabolically important compounds, Clin. Chem., 1980, 26, 13, 1839-1846. [all data]