Disulfide, ethyl hexyl

Kovats' RI, polar column, isothermal

View large format table.

Column type Active phase Temperature (C) I Reference Comment
PackedCarbowax 20M110.1596.Möckel and Zolg, 1977He, Chromosorb W AW (80-100 mesh); Column length: 6. m

References

Möckel and Zolg, 1977
Möckel, H.J.; Zolg, M., Retentionsindices n-aliphatischer Schwefelverbindungen, Z. Anal. Chem., 1977, 285, 1, 45-46, https://doi.org/10.1007/BF00446017 . [all data]