Methylcitric acid, tetrakis-TMS

Van Den Dool and Kratz RI, non-polar column, custom temperature program

Data compiled by: NIST Mass Spectrometry Data Center, William E. Wallace, director

Column type CapillaryCapillaryPacked
Active phase DB-1DB-1OV-101
Column length (m)
Carrier gas HeHe
Substrate
Column diameter (mm)
Phase thickness (μm)
Program not specifiednot specifiednot specified
I 1858.1866.1866.
ReferenceTsai, Oliphant, et al., 1985Tsai, Oliphant, et al., 1985Tanaka and Hine, 1982
Comment MSDC-RI MSDC-RI MSDC-RI

References

Tsai, Oliphant, et al., 1985
Tsai, M.Y.; Oliphant, C.; Josephson, M.W., Identification of Metabolites Diagnostic for Organic Acidurias by Simultaneous Dual-Column Capillary Gas Chromatography, J. Chromatogr., 1985, 341, 1-10, https://doi.org/10.1016/S0378-4347(00)84004-9 . [all data]

Tanaka and Hine, 1982
Tanaka, K.; Hine, D.G., Compilation of Gas Chromatographic Retention Indices of 163 Metabolically Important Organic Acids, and Their Use in Detection of Patients with Organic Acidurias, J. Chromatogr., 1982, 239, 301-322, https://doi.org/10.1016/S0021-9673(00)81990-1 . [all data]