exo-THC, trimethylsilyl ether

Van Den Dool and Kratz RI, non-polar column, temperature ramp

View large format table.

Column type Active phase I Reference Comment
CapillaryVF-5MS2365.7Tretyakov, 201430. m/0.25 mm/0.25 μm, He; Tstart: 60. C; Tend: 270. C

Normal alkane RI, non-polar column, temperature ramp

View large format table.

Column type Active phase I Reference Comment
PackedSe-302335.Harvey, 1977N2, Gas Chrom Q, 2. K/min; Column length: 2.0 m; Tstart: 150. C; Tend: 290. C

References

Tretyakov, 2014
Tretyakov, K.V., Retention Data. NIST Mass Spectrometry Data Center., NIST Mass Spectrometry Data Center, 2014. [all data]

Harvey, 1977
Harvey, D.J., Allyldimethylsilyl ethers as derivatives for the characterization of steroids and cannabinoids by combined gas chromatography and mass spectrometry, Biomed. Mass Spectrom., 1977, 4, 4, 265-274, https://doi.org/10.1002/bms.1200040414 . [all data]