Hexadecylamine, N-allyl-
- Formula: C19H39N
- Molecular weight: 281.5197
- IUPAC Standard InChIKey: BGMODKVMRWSBLQ-UHFFFAOYSA-N
- Chemical structure:

Van Den Dool and Kratz RI, non-polar column, temperature ramp

Column type | Active phase | I | Reference | Comment |
---|---|---|---|---|
Capillary | 5 % Phenyl methyl siloxane | 2698. | Zaikin, 2014 | 30. m/0.25 mm/0.25 μm, 15. K/min, 270. C @ 15. min; Tstart: 60. C |

References

Zaikin, 2014
Zaikin, V.G.,
Personal communication: Retention indices measured during 2014, 2014. [all data]