5β-Estran-17α-ethyl-3α,17β-diol, di-trimethylsilyl

Kovats' RI, non-polar column, isothermal

View large format table.

Column type Active phase Temperature (C) I Reference Comment
PackedOV-1210.2700.Brooks, Thawley, et al., 1971

References

Brooks, Thawley, et al., 1971
Brooks, C.J.W.; Thawley, A.R.; Rocher, P.; Middleditch, B.S.; Anthony, G.M.; Stillwell, W.G., Characterization of Steroidal Drug Metabolites by Combined Gas Chromatography-Mass Spectrometry, J. Chromatogr. Sci., 1971, 9, 1, 35-43, https://doi.org/10.1093/chromsci/9.1.35 . [all data]