4-Androsten-9α-fluoro-17α-methyl-3α,6β,11β,17β-tetra-ol, tetra-trimethylsilyl

Normal alkane RI, non-polar column, custom temperature program

View large format table.

Column type Active phase I Reference Comment
CapillaryDB-12858.Bowers and Borts, 199630. m/0.25 mm/0.1 μm, He; Program: 170C => 20C/min => 260C => 2.7C/min => 305C => 20C/min => 320C

References

Bowers and Borts, 1996
Bowers, L.D.; Borts, D.J., Separation and confirmation of anabolic steroids with quadrupole ion trap tandem mass spectrometry, J. Chromatogr. B, 1996, 687, 1, 69-78, https://doi.org/10.1016/S0378-4347(96)00231-9 . [all data]