benzoic acid, 4-amino-, hexyl ester

Normal alkane RI, non-polar column, isothermal

Data compiled by: NIST Mass Spectrometry Data Center, William E. Wallace, director

Column type CapillaryCapillary
Active phase JXRJXR
Column length (m)
Carrier gas
Substrate
Column diameter (mm)
Phase thickness (μm)
Temperature (C) 180.200.
I 1956.1955.
Referencevon Buchi, Lorini, et al., 1972von Buchi, Lorini, et al., 1972
Comment MSDC-RI MSDC-RI

References

von Buchi, Lorini, et al., 1972
von Buchi, J.; Lorini, V.; Perlia, X., Gaschromatographische Untersuchung einiger homologer Reihen von Lokalanaesthetica, Pharm. Acta Helv., 1972, 47, 65, 377-393. [all data]