11-Deoxycortisol, bis(trimethylsilyl) ether, bis(O-methyloxime)

Kovats' RI, non-polar column, custom temperature program

Data compiled by: NIST Mass Spectrometry Data Center, William E. Wallace, director

Column type Capillary
Active phase ZB-1
Column length (m) 30.
Carrier gas He
Substrate
Column diameter (mm) 0.25
Phase thickness (μm) 0.25
Program 70C(5min) => 20C/min => 220C(0.33min) => 5C/min => 315C (4min)
I 3124.
ReferenceEbner, Corol, et al., 2006
Comment MSDC-RI

References

Ebner, Corol, et al., 2006
Ebner, M.J.; Corol, D.I.; Havlíková, H.; Honour, J.W.; Fry, J.P., Identification of neuroactive steroids and their precursors and metabolites in adult male rat brain, Endocrinology, 2006, 147, 1, 179-190, https://doi.org/10.1210/en.2005-1065 . [all data]