DL-Arabinopyranose, tetrakis(trifluoroacetate) (isomer 2)

Van Den Dool and Kratz RI, non-polar column, temperature ramp

Data compiled by: NIST Mass Spectrometry Data Center, William E. Wallace, director

Column type Capillary
Active phase VF-5MS
Column length (m) 30.
Carrier gas He
Substrate
Column diameter (mm) 0.25
Phase thickness (μm) 0.25
Tstart (C) 60.
Tend (C) 270.
Heat rate (K/min)
Initial hold (min)
Final hold (min)
I 1105.5
ReferenceTretyakov, 2011
Comment MSDC-RI

References

Tretyakov, 2011
Tretyakov, K.V., Retention Data (March 2011). NIST Mass Spectrometry Data Center., NIST Mass Spectrometry Data Center, 2011. [all data]