2-([(Dimethylamino)methylene]amino)-3-(3-chloro-4-ethyloxy-phenyl)propanoic acid, ethyl ester

Van Den Dool and Kratz RI, non-polar column, temperature ramp

View large format table.

Column type Active phase I Reference Comment
CapillaryVF-5MS2277.Zheng, 201130. m/0.25 mm/0.25 μm, He; Tstart: 60. C; Tend: 270. C

References

Zheng, 2011
Zheng, Yufang, Retention Data. NIST Mass Spectrometry Data Center., NIST Mass Spectrometry Data Center, 2011. [all data]