Salicylic acid, 2TBDMS derivative

Normal alkane RI, non-polar column, temperature ramp

Data compiled by: NIST Mass Spectrometry Data Center, William E. Wallace, director

Column type CapillaryCapillaryCapillary
Active phase DB-5DB-5DB-5
Column length (m) 30.30.30.
Carrier gas Helium
Substrate
Column diameter (mm) 0.250.250.25
Phase thickness (μm) 0.250.250.25
Tstart (C) 60.230.60.
Tend (C) 290.280.280.
Heat rate (K/min) 4.4.3.
Initial hold (min) 2.2.
Final hold (min)
I 1965.1993.51971.
ReferencePaik, Lee, et al., 2005Kim, Shim, et al., 1993Kim, Kim, et al., 1990
Comment MSDC-RI MSDC-RI MSDC-RI

References

Paik, Lee, et al., 2005
Paik, M.-J.; Lee, H.-J.; Kim, K.-R., Simultaneous retention index analysis of urinary amino acids and carboxylic acids for graphic recognition of abnormal state, J. Chromatogr. B, 2005, 821, 1, 94-104, https://doi.org/10.1016/j.jchromb.2005.04.011 . [all data]

Kim, Shim, et al., 1993
Kim, K.-R.; Shim, W.-H.; Shin, Y.-J.; Park, J.; Myung, S.; Hong, J., Capillary gas chromatography of acidic non-steroidal antiinflammatory drugs as tert.-butyldimethylsilyl derivatives, J. Chromatogr. A, 1993, 641, 2, 319-327, https://doi.org/10.1016/0021-9673(93)80148-2 . [all data]

Kim, Kim, et al., 1990
Kim, K.-R.; Kim, J.-H.; Park, H.-K., Trace analysis as TBDMS derivatives of organic acids in aqueous samples, J. Korean Chem. Soc., 1990, 34, 4, 352-359. [all data]