(E)-4-Oxohex-2-enal

Normal alkane RI, non-polar column, custom temperature program

View large format table.

Column type Active phase I Reference Comment
CapillaryHP-1958.Yasuda and Higuchi, 2012Program: not specified

Normal alkane RI, polar column, custom temperature program

View large format table.

Column type Active phase I Reference Comment
CapillaryHP-Innowax1599.Yasuda and Higuchi, 2012Program: not specified

References

Yasuda and Higuchi, 2012
Yasuda, T.; Higuchi, H., Sex pheromones of Stenotus rubrovittatus and Trigonotylus caelestialium, two mirid bugs causing pecky rice and their application to insect monitoring in Japan, Psyshe, 2012, 2012, 1-8, https://doi.org/Article ID 435640 . [all data]