(E)-Hex-3-enyl 3-chlorobenzoate

Van Den Dool and Kratz RI, polar column, temperature ramp

Data compiled by: NIST Mass Spectrometry Data Center, William E. Wallace, director

Column type CapillaryCapillaryCapillary
Active phase OV-351OV-351OV-351
Column length (m) 25.25.25.
Carrier gas N2N2N2
Substrate
Column diameter (mm) 0.320.320.32
Phase thickness (μm)
Tstart (C) 100.100.100.
Tend (C) 230.230.230.
Heat rate (K/min) 10.2.6.
Initial hold (min)
Final hold (min)
I 2312.2282.2293.
ReferenceKorhonen and Lind, 1985Korhonen and Lind, 1985Korhonen and Lind, 1985
Comment MSDC-RI MSDC-RI MSDC-RI

Kovats' RI, non-polar column, isothermal

View large format table.

Column type Active phase Temperature (C) I Reference Comment
CapillarySE-30140.1686.Korhonen and Lind, 1985
CapillarySE-30160.1696.Korhonen and Lind, 1985
CapillarySE-30200.1704.Korhonen and Lind, 1985

Kovats' RI, polar column, isothermal

View large format table.

Column type Active phase Temperature (C) I Reference Comment
CapillaryOV-351140.2255.Korhonen and Lind, 1985N2; Column length: 25. m; Column diameter: 0.32 mm
CapillaryOV-351160.2276.Korhonen and Lind, 1985N2; Column length: 25. m; Column diameter: 0.32 mm
CapillaryOV-351180.2296.Korhonen and Lind, 1985N2; Column length: 25. m; Column diameter: 0.32 mm

Van Den Dool and Kratz RI, non-polar column, temperature ramp

View large format table.

Column type Active phase I Reference Comment
CapillaryVF-5MS1739.Liang, 201030. m/0.25 mm/0.25 μm, He; Tstart: 60. C; Tend: 270. C
CapillarySE-301712.Korhonen and Lind, 198510. K/min; Tstart: 100. C; Tend: 280. C
CapillarySE-301691.Korhonen and Lind, 19852. K/min; Tstart: 100. C; Tend: 280. C
CapillarySE-301702.Korhonen and Lind, 19856. K/min; Tstart: 100. C; Tend: 280. C

References

Korhonen and Lind, 1985
Korhonen, I.O.O.; Lind, M.A., Gas-liquid chromatographic analyses. XXXVIII. Capillary column studies of unsaturated esters of benzoic and monochlorobenzoic acids, J. Chromatogr., 1985, 324, 113-127, https://doi.org/10.1016/S0021-9673(01)81311-X . [all data]