Pent-4-enyl 3-chlorobenzoate

Kovats' RI, polar column, isothermal

Data compiled by: NIST Mass Spectrometry Data Center, William E. Wallace, director

Column type CapillaryCapillaryCapillary
Active phase OV-351OV-351OV-351
Column length (m) 25.25.25.
Carrier gas N2N2N2
Substrate
Column diameter (mm) 0.320.320.32
Phase thickness (μm)
Temperature (C) 140.160.180.
I 2187.2208.2229.
ReferenceKorhonen and Lind, 1985Korhonen and Lind, 1985Korhonen and Lind, 1985
Comment MSDC-RI MSDC-RI MSDC-RI

Kovats' RI, non-polar column, isothermal

Data compiled by: NIST Mass Spectrometry Data Center, William E. Wallace, director

Column type CapillaryCapillaryCapillary
Active phase SE-30SE-30SE-30
Column length (m)
Carrier gas
Substrate
Column diameter (mm)
Phase thickness (μm)
Temperature (C) 140.160.200.
I 1593.1604.1612.
ReferenceKorhonen and Lind, 1985Korhonen and Lind, 1985Korhonen and Lind, 1985
Comment MSDC-RI MSDC-RI MSDC-RI

References

Korhonen and Lind, 1985
Korhonen, I.O.O.; Lind, M.A., Gas-liquid chromatographic analyses. XXXVIII. Capillary column studies of unsaturated esters of benzoic and monochlorobenzoic acids, J. Chromatogr., 1985, 324, 113-127, https://doi.org/10.1016/S0021-9673(01)81311-X . [all data]