(Z)-Hex-3-enyl 3-chlorobenzoate

Kovats' RI, non-polar column, isothermal

View large format table.

Column type Active phase Temperature (C) I Reference Comment
CapillarySE-30140.1695.Korhonen and Lind, 1985
CapillarySE-30160.1706.Korhonen and Lind, 1985
CapillarySE-30200.1715.Korhonen and Lind, 1985

Kovats' RI, polar column, isothermal

View large format table.

Column type Active phase Temperature (C) I Reference Comment
CapillaryOV-351140.2276.Korhonen and Lind, 1985N2; Column length: 25. m; Column diameter: 0.32 mm
CapillaryOV-351160.2298.Korhonen and Lind, 1985N2; Column length: 25. m; Column diameter: 0.32 mm
CapillaryOV-351180.2319.Korhonen and Lind, 1985N2; Column length: 25. m; Column diameter: 0.32 mm

Van Den Dool and Kratz RI, non-polar column, temperature ramp

View large format table.

Column type Active phase I Reference Comment
CapillaryVF-5MS1751.Liang, 201030. m/0.25 mm/0.25 μm, He; Tstart: 60. C; Tend: 270. C
CapillarySE-301724.Korhonen and Lind, 198510. K/min; Tstart: 100. C; Tend: 280. C
CapillarySE-301701.Korhonen and Lind, 19852. K/min; Tstart: 100. C; Tend: 280. C
CapillarySE-301715.Korhonen and Lind, 19856. K/min; Tstart: 100. C; Tend: 280. C

Van Den Dool and Kratz RI, polar column, temperature ramp

View large format table.

Column type Active phase I Reference Comment
CapillaryOV-3512335.Korhonen and Lind, 1985N2, 10. K/min; Column length: 25. m; Column diameter: 0.32 mm; Tstart: 100. C; Tend: 230. C
CapillaryOV-3512306.Korhonen and Lind, 1985N2, 2. K/min; Column length: 25. m; Column diameter: 0.32 mm; Tstart: 100. C; Tend: 230. C
CapillaryOV-3512318.Korhonen and Lind, 1985N2, 6. K/min; Column length: 25. m; Column diameter: 0.32 mm; Tstart: 100. C; Tend: 230. C

References

Korhonen and Lind, 1985
Korhonen, I.O.O.; Lind, M.A., Gas-liquid chromatographic analyses. XXXVIII. Capillary column studies of unsaturated esters of benzoic and monochlorobenzoic acids, J. Chromatogr., 1985, 324, 113-127, https://doi.org/10.1016/S0021-9673(01)81311-X . [all data]

Liang, 2010
Liang, Y., Retention Data. NIST Mass Spectrometry Data Center., NIST Mass Spectrometry Data Center, 2010. [all data]