sec-Butyl 3-chlorobenzoate

Kovats' RI, non-polar column, isothermal

View large format table.

Column type Active phase Temperature (C) I Reference Comment
CapillarySE-30140.1446.Korhonen and Lind, 1985N2; Column length: 25. m; Column diameter: 0.32 mm
CapillarySE-30160.1456.Korhonen and Lind, 1985N2; Column length: 25. m; Column diameter: 0.32 mm
CapillarySE-30180.1465.Korhonen and Lind, 1985N2; Column length: 25. m; Column diameter: 0.32 mm

Kovats' RI, polar column, isothermal

View large format table.

Column type Active phase Temperature (C) I Reference Comment
CapillaryOV-351140.1936.Korhonen and Lind, 1985N2; Column length: 25. m; Column diameter: 0.32 mm
CapillaryOV-351160.1956.Korhonen and Lind, 1985N2; Column length: 25. m; Column diameter: 0.32 mm
CapillaryOV-351180.1969.Korhonen and Lind, 1985N2; Column length: 25. m; Column diameter: 0.32 mm

Van Den Dool and Kratz RI, non-polar column, temperature ramp

View large format table.

Column type Active phase I Reference Comment
CapillaryVF-5MS1479.Liang, 201030. m/0.25 mm/0.25 μm, He; Tstart: 60. C; Tend: 270. C
CapillarySE-301455.Korhonen and Lind, 1985N2, 10. K/min; Column length: 25. m; Column diameter: 0.32 mm; Tstart: 100. C; Tend: 300. C
CapillarySE-301440.Korhonen and Lind, 1985N2, 2. K/min; Column length: 25. m; Column diameter: 0.32 mm; Tstart: 100. C; Tend: 300. C
CapillarySE-301449.Korhonen and Lind, 1985N2, 6. K/min; Column length: 25. m; Column diameter: 0.32 mm; Tstart: 100. C; Tend: 300. C

Van Den Dool and Kratz RI, polar column, temperature ramp

View large format table.

Column type Active phase I Reference Comment
CapillaryOV-3511969.Korhonen and Lind, 1985N2, 10. K/min; Column length: 25. m; Column diameter: 0.32 mm; Tstart: 100. C; Tend: 230. C
CapillaryOV-3511935.Korhonen and Lind, 1985N2, 2. K/min; Column length: 25. m; Column diameter: 0.32 mm; Tstart: 100. C; Tend: 230. C
CapillaryOV-3511957.Korhonen and Lind, 1985N2, 6. K/min; Column length: 25. m; Column diameter: 0.32 mm; Tstart: 100. C; Tend: 230. C

References

Korhonen and Lind, 1985
Korhonen, I.O.O.; Lind, M.A., Gas-liquid chromatographic analyses. XXXVII. Capillary column studies of benzoyl and monochlorobenzoyl esters of lower saturated branched-chain alcohols, J. Chromatogr., 1985, 323, 2, 331-342, https://doi.org/10.1016/S0021-9673(01)90395-4 . [all data]

Liang, 2010
Liang, Y., Retention Data. NIST Mass Spectrometry Data Center., NIST Mass Spectrometry Data Center, 2010. [all data]