Isobutyl 3-chlorobenzoate

Van Den Dool and Kratz RI, polar column, temperature ramp

Data compiled by: NIST Mass Spectrometry Data Center, William E. Wallace, director

Column type CapillaryCapillaryCapillary
Active phase OV-351OV-351OV-351
Column length (m) 25.25.25.
Carrier gas N2N2N2
Substrate
Column diameter (mm) 0.320.320.32
Phase thickness (μm)
Tstart (C) 100.100.100.
Tend (C) 230.230.230.
Heat rate (K/min) 10.2.6.
Initial hold (min)
Final hold (min)
I 2004.1969.1989.
ReferenceKorhonen and Lind, 1985Korhonen and Lind, 1985Korhonen and Lind, 1985
Comment MSDC-RI MSDC-RI MSDC-RI

References

Korhonen and Lind, 1985
Korhonen, I.O.O.; Lind, M.A., Gas-liquid chromatographic analyses. XXXVII. Capillary column studies of benzoyl and monochlorobenzoyl esters of lower saturated branched-chain alcohols, J. Chromatogr., 1985, 323, 2, 331-342, https://doi.org/10.1016/S0021-9673(01)90395-4 . [all data]