1-[4-(2,2,2-Trifluoroacetoxy)phenyl]-2-[(trifluoroacetyl)amino]ethyl trifluoroacetate

Normal alkane RI, non-polar column, isothermal

Data compiled by: NIST Mass Spectrometry Data Center, William E. Wallace, director

Column type Packed
Active phase OV-101
Column length (m) 1.8
Carrier gas Helium
Substrate Chromosorb GHP
Column diameter (mm)
Phase thickness (μm)
Temperature (C) 170.
I 1450.
ReferenceMidgley, Couch, et al., 1980
Comment MSDC-RI

References

Midgley, Couch, et al., 1980
Midgley, J.M.; Couch, M.W.; Crowley, J.R.; Willians, C.M., m-Synephrine: Normal Occurence in Adrenal Gland, J. Neurochem., 1980, 34, 5, 1225-1230, https://doi.org/10.1111/j.1471-4159.1980.tb09963.x . [all data]